[Python-checkins] buildbot failure in OS X x86 3.x

buildbot at python.org buildbot at python.org
Thu Feb 5 01:24:40 CET 2009


The Buildbot has detected a new failure of OS X x86 3.x.
Full details are available at:
 http://www.python.org/dev/buildbot/all/OS%20X%20x86%203.x/builds/141

Buildbot URL: http://www.python.org/dev/buildbot/all/

Buildslave for this Build: noller-osx86

Build Reason: 
Build Source Stamp: [branch branches/py3k] HEAD
Blamelist: benjamin.peterson

BUILD FAILED: failed test

Excerpt from the test logfile:
2 tests failed:
    test_cmd_line test_urllib

======================================================================
FAIL: test_run_code (test.test_cmd_line.CmdLineTest)
----------------------------------------------------------------------

Traceback (most recent call last):
  File "/Users/buildbot/buildarea/3.x.noller-osx86/build/Lib/test/test_cmd_line.py", line 143, in test_run_code
    0)
AssertionError: 1 != 0

======================================================================
ERROR: test_empty_socket (test.test_urllib.urlopen_HttpTests)
----------------------------------------------------------------------

Traceback (most recent call last):
  File "/Users/buildbot/buildarea/3.x.noller-osx86/build/Lib/test/test_urllib.py", line 194, in test_empty_socket
    self.assertRaises(IOError, urlopen, "http://something")
  File "/Users/buildbot/buildarea/3.x.noller-osx86/build/Lib/unittest.py", line 344, in failUnlessRaises
    callableObj(*args, **kwargs)
  File "/Users/buildbot/buildarea/3.x.noller-osx86/build/Lib/test/test_urllib.py", line 33, in urlopen
    return opener.open(url)
  File "/Users/buildbot/buildarea/3.x.noller-osx86/build/Lib/urllib/request.py", line 1444, in open
    return getattr(self, name)(url)
  File "/Users/buildbot/buildarea/3.x.noller-osx86/build/Lib/urllib/request.py", line 1618, in open_http
    return self._open_generic_http(http.client.HTTPConnection, url, data)
  File "/Users/buildbot/buildarea/3.x.noller-osx86/build/Lib/urllib/request.py", line 1601, in _open_generic_http
    response = http_conn.getresponse()
  File "/Users/buildbot/buildarea/3.x.noller-osx86/build/Lib/http/client.py", line 937, in getresponse
    method=self._method)
  File "/Users/buildbot/buildarea/3.x.noller-osx86/build/Lib/http/client.py", line 275, in __init__
    self.fp = sock.makefile("rb")
TypeError: makefile() takes exactly 3 positional arguments (2 given)

======================================================================
ERROR: test_read (test.test_urllib.urlopen_HttpTests)
----------------------------------------------------------------------

Traceback (most recent call last):
  File "/Users/buildbot/buildarea/3.x.noller-osx86/build/Lib/test/test_urllib.py", line 168, in test_read
    fp = urlopen("http://python.org/")
  File "/Users/buildbot/buildarea/3.x.noller-osx86/build/Lib/test/test_urllib.py", line 33, in urlopen
    return opener.open(url)
  File "/Users/buildbot/buildarea/3.x.noller-osx86/build/Lib/urllib/request.py", line 1444, in open
    return getattr(self, name)(url)
  File "/Users/buildbot/buildarea/3.x.noller-osx86/build/Lib/urllib/request.py", line 1618, in open_http
    return self._open_generic_http(http.client.HTTPConnection, url, data)
  File "/Users/buildbot/buildarea/3.x.noller-osx86/build/Lib/urllib/request.py", line 1601, in _open_generic_http
    response = http_conn.getresponse()
  File "/Users/buildbot/buildarea/3.x.noller-osx86/build/Lib/http/client.py", line 937, in getresponse
    method=self._method)
  File "/Users/buildbot/buildarea/3.x.noller-osx86/build/Lib/http/client.py", line 275, in __init__
    self.fp = sock.makefile("rb")
TypeError: makefile() takes exactly 3 positional arguments (2 given)

======================================================================
ERROR: test_read_bogus (test.test_urllib.urlopen_HttpTests)
----------------------------------------------------------------------

Traceback (most recent call last):
  File "/Users/buildbot/buildarea/3.x.noller-osx86/build/Lib/test/test_urllib.py", line 185, in test_read_bogus
    self.assertRaises(IOError, urlopen, "http://python.org/")
  File "/Users/buildbot/buildarea/3.x.noller-osx86/build/Lib/unittest.py", line 344, in failUnlessRaises
    callableObj(*args, **kwargs)
  File "/Users/buildbot/buildarea/3.x.noller-osx86/build/Lib/test/test_urllib.py", line 33, in urlopen
    return opener.open(url)
  File "/Users/buildbot/buildarea/3.x.noller-osx86/build/Lib/urllib/request.py", line 1444, in open
    return getattr(self, name)(url)
  File "/Users/buildbot/buildarea/3.x.noller-osx86/build/Lib/urllib/request.py", line 1618, in open_http
    return self._open_generic_http(http.client.HTTPConnection, url, data)
  File "/Users/buildbot/buildarea/3.x.noller-osx86/build/Lib/urllib/request.py", line 1601, in _open_generic_http
    response = http_conn.getresponse()
  File "/Users/buildbot/buildarea/3.x.noller-osx86/build/Lib/http/client.py", line 937, in getresponse
    method=self._method)
  File "/Users/buildbot/buildarea/3.x.noller-osx86/build/Lib/http/client.py", line 275, in __init__
    self.fp = sock.makefile("rb")
TypeError: makefile() takes exactly 3 positional arguments (2 given)

make: *** [buildbottest] Error 1

sincerely,
 -The Buildbot



More information about the Python-checkins mailing list