[Python-checkins] buildbot failure in ppc Debian unstable trunk

buildbot at python.org buildbot at python.org
Sun Jun 1 18:57:31 CEST 2008


The Buildbot has detected a new failure of ppc Debian unstable trunk.
Full details are available at:
 http://www.python.org/dev/buildbot/all/ppc%20Debian%20unstable%20trunk/builds/1504

Buildbot URL: http://www.python.org/dev/buildbot/all/

Buildslave for this Build: klose-debian-ppc

Build Reason: 
Build Source Stamp: [branch trunk] HEAD
Blamelist: robert.schuppenies

BUILD FAILED: failed test

Excerpt from the test logfile:
2 tests failed:
    test_descrtut test_sys

======================================================================
FAIL: test_standardtypes (test.test_sys.SizeofTest)
----------------------------------------------------------------------

Traceback (most recent call last):
  File "/home/pybot/buildarea/trunk.klose-debian-ppc/build/Lib/test/test_sys.py", line 456, in test_standardtypes
    self.check_sizeof(bytes(), h + self.align(i) + l + p)
  File "/home/pybot/buildarea/trunk.klose-debian-ppc/build/Lib/test/test_sys.py", line 428, in check_sizeof
    self.assertEqual(result, size, msg)
AssertionError: wrong size for <type 'str'>: got 32, expected 28

make: *** [buildbottest] Error 1

sincerely,
 -The Buildbot



More information about the Python-checkins mailing list