[Python-checkins] buildbot failure in x86 FreeBSD 3.0

buildbot at python.org buildbot at python.org
Mon Dec 31 18:24:24 CET 2007


The Buildbot has detected a new failure of x86 FreeBSD 3.0.
Full details are available at:
 http://www.python.org/dev/buildbot/all/x86%20FreeBSD%203.0/builds/345

Buildbot URL: http://www.python.org/dev/buildbot/all/

Buildslave for this Build: bolen-freebsd

Build Reason: 
Build Source Stamp: [branch branches/py3k] HEAD
Blamelist: christian.heimes

BUILD FAILED: failed test

Excerpt from the test logfile:
2 tests failed:
    test_asynchat test_richcmp

======================================================================
FAIL: test_close_when_done (test.test_asynchat.TestAsynchat_WithPoll)
----------------------------------------------------------------------

Traceback (most recent call last):
  File "/usr/home/db3l/buildarea/3.0.bolen-freebsd/build/Lib/test/test_asynchat.py", line 211, in test_close_when_done
    self.assertTrue(len(s.buffer) > 0)
AssertionError: None

======================================================================
FAIL: test_simpleOrderHashable (test.test_richcmp.HashableTest)
----------------------------------------------------------------------

Traceback (most recent call last):
  File "/usr/home/db3l/buildarea/3.0.bolen-freebsd/build/Lib/test/test_richcmp.py", line 376, in test_simpleOrderHashable
    self.assert_(a.__hash__ is not None)
AssertionError: None

sincerely,
 -The Buildbot



More information about the Python-checkins mailing list